[ playerstage-Bugs-3481595 ] Trouble while installing Player 3.0.1

classic Classic list List threaded Threaded
1 message Options
Reply | Threaded
Open this post in threaded view
|

[ playerstage-Bugs-3481595 ] Trouble while installing Player 3.0.1

SourceForge.net
Bugs item #3481595, was opened at 2012-01-30 03:08
Message generated for change (Tracker Item Submitted) made by ksolid
You can respond by visiting:
https://sourceforge.net/tracker/?func=detail&atid=433164&aid=3481595&group_id=42445

Please note that this message will contain a full copy of the comment thread,
including the initial issue submission, for this request,
not just the latest update.
Category: player
Group: None
Status: Open
Resolution: None
Priority: 5
Private: No
Submitted By: ksolid (ksolid)
Assigned to: Rich Mattes (jpgr87)
Summary: Trouble while installing Player 3.0.1

Initial Comment:
Hello all,
I am fine problem to install Player 3.0.1 (for gazebo) error is bellow, more detaled are in the attached file (cmake make messages).
.
.
.
.
[ 69%] Building CXX object server/libplayerdrivers/CMakeFiles/playerdrivers.dir/__/drivers/ptz/sonyevid30.o
/home/bkhelifa/Downloads/player-3.0.1/server/drivers/ptz/sonyevid30.cc: In member function ‘int SonyEVID30::Receive(unsigned char*)’:
/home/bkhelifa/Downloads/player-3.0.1/server/drivers/ptz/sonyevid30.cc:801:7: warning: variable ‘temp’ set but not used [-Wunused-but-set-variable]
[ 69%] Building CXX object server/libplayerdrivers/CMakeFiles/playerdrivers.dir/__/drivers/ptz/sphereptz/sphereptz.o
/home/bkhelifa/Downloads/player-3.0.1/server/drivers/ptz/sphereptz/sphereptz.cc: In member function ‘virtual int SpherePTZ::MainSetup()’:
/home/bkhelifa/Downloads/player-3.0.1/server/drivers/ptz/sphereptz/sphereptz.cc:198:26: error: aggregate ‘SpherePTZ::MainSetup()::v4l2_capability cap’ has incomplete type and cannot be defined
/home/bkhelifa/Downloads/player-3.0.1/server/drivers/ptz/sphereptz/sphereptz.cc:215:23: error: ‘VIDIOC_QUERYCAP’ was not declared in this scope
/home/bkhelifa/Downloads/player-3.0.1/server/drivers/ptz/sphereptz/sphereptz.cc:222:28: error: ‘V4L2_CAP_STREAMING’ was not declared in this scope
/home/bkhelifa/Downloads/player-3.0.1/server/drivers/ptz/sphereptz/sphereptz.cc:226:28: error: ‘V4L2_CAP_READWRITE’ was not declared in this scope
make[2]: *** [server/libplayerdrivers/CMakeFiles/playerdrivers.dir/__/drivers/ptz/sphereptz/sphereptz.o] Error 1
make[1]: *** [server/libplayerdrivers/CMakeFiles/playerdrivers.dir/all] Error 2
make: *** [all] Error 2

Any help thank you in advance,

----------------------------------------------------------------------

You can respond by visiting:
https://sourceforge.net/tracker/?func=detail&atid=433164&aid=3481595&group_id=42445

------------------------------------------------------------------------------
Try before you buy = See our experts in action!
The most comprehensive online learning library for Microsoft developers
is just $99.99! Visual Studio, SharePoint, SQL - plus HTML5, CSS3, MVC3,
Metro Style Apps, more. Free future releases when you subscribe now!
http://p.sf.net/sfu/learndevnow-dev2
_______________________________________________
Playerstage-developers mailing list
[hidden email]
https://lists.sourceforge.net/lists/listinfo/playerstage-developers